{"text_format":"1","workbook":"xlsx","n_sheets":4,"sheets":["Hoja inscripción","export","datos","ORGANIZADORES"],"not_rendered":{"charts":0,"images":3,"macros":1,"external_links":1,"defined_names":49,"comments":0,"pivot_tables":0},"unopened":[],"bounds":{"document_bytes":16777216,"sheet_cells":100000,"rows_first":2000,"rows_last":500,"rows_between":2000,"halvings":0,"cell_chars":16384,"cell_head_chars":4096},"cells_cut":0,"cells_raw":0,"read":"whole","date_system":"1900"}

{"sheet":"Hoja inscripción","index":0,"n_rows":122,"n_cols":43,"rows_kept":122,"cut":false,"hidden":false,"merged":[[65,2,65,19],[63,2,63,11],[58,2,58,6],[58,17,58,19],[76,15,76,19],[49,16,49,17],[51,11,51,14],[51,15,51,19],[5,2,5,11],[5,14,5,19],[112,2,113,19],[114,2,117,19],[118,2,120,19],[72,12,72,19],[16,4,16,18],[86,2,86,19],[89,3,89,6],[17,15,17,16],[36,10,36,14],[75,6,75,10],[76,6,76,10],[73,6,73,10],[74,6,74,10],[71,14,71,15],[67,12,67,19],[51,8,51,10],[63,12,63,19],[60,3,60,19],[56,18,56,19],[47,15,47,19],[40,16,40,17],[24,15,24,19],[121,2,124,19],[18,6,18,14],[18,17,18,18],[18,15,18,16],[75,15,75,19],[77,9,77,10],[59,2,59,6],[59,7,59,10],[77,15,77,19],[31,18,31,19],[74,14,74,19],[51,5,51,7],[69,14,69,17],[49,5,49,8],[73,14,73,19],[49,9,49,13],[49,14,49,15],[68,14,68,15],[72,2,72,11],[44,2,51,4],[42,11,42,14],[56,15,56,16],[36,5,36,9],[40,5,40,8],[40,9,40,13],[53,2,53,19],[56,2,56,6],[47,5,47,13],[7,14,8,19],[10,17,13,17],[9,18,9,19],[12,5,12,6],[24,10,24,14],[27,5,27,13],[45,5,45,9],[33,5,33,7],[33,8,33,10],[40,14,40,15],[56,7,56,10],[36,15,36,19],[38,5,38,13],[42,15,42,19],[45,10,45,14],[45,15,45,19],[15,2,15,19],[20,2,20,19],[22,2,33,4],[10,14,11,14],[12,14,13,14],[29,5,29,13],[33,11,33,14],[33,15,33,19],[31,14,31,15],[10,18,13,19],[108,7,111,18],[89,7,89,18],[56,11,56,14],[17,17,17,18],[24,5,24,9],[29,15,29,19],[31,5,31,8],[31,9,31,13],[101,3,101,6],[101,7,101,18],[103,3,103,6],[91,7,94,18],[103,7,106,18],[70,14,70,17],[17,6,17,14],[38,15,38,19],[27,14,27,19],[31,16,31,17],[91,3,91,6],[96,7,99,18],[67,2,67,11],[35,2,42,4],[42,5,42,7],[42,8,42,10]]}
[]
[null,null,null,null,null,null,null,null,null,null,null,null,null,null,null,null,null,null,null,null,null,null,null,null,null,null,null,null,null,null,null,null,null,null,null,"",null,null,null,null,null,null,""]
[]
[]
[]
[null,null,"SOL·LICITUD d'INSCRIPCIÓ",null,null,null,null,null,null,null,null,null,null,null,{"$f":"VLOOKUP(ORGANIZADORES!$B$13,ORGANIZADORES!$A$3:$P$12,2,FALSE)","v":"RallyRACC Catalunya - Costa Daurada"}]
[]
[null,null,null,"Organitzador:",null,null,null,null,null,null,null,null,null,null,"Reservat organitzador"]
[]
[null,null,null,null,{"$f":"VLOOKUP(ORGANIZADORES!$B$13,ORGANIZADORES!$A$2:$P$12,4,FALSE)","v":"RACC"},null,null,null,null,null,null,null,null,null,null,null,null,"Puntuabilidad","NUMERO"]
[null,null,null,null,{"$f":"VLOOKUP(ORGANIZADORES!$B$13,ORGANIZADORES!$A$3:$P$12,5,FALSE)","v":"Avda. Diagonal, 687"}]
[null,null,null,null,{"$f":"VLOOKUP(ORGANIZADORES!$B$13,ORGANIZADORES!$A$3:$P$12,9,FALSE)","v":"08028 BARCELONA (BCN)"}]
[null,null,null,null,"Tf.",{"$f":"VLOOKUP(ORGANIZADORES!$B$13,ORGANIZADORES!$A$3:$P$12,10,FALSE)","v":"93 495 50 34"}]
[null,null,null,null,"e-mail: info@wrcmanagement.es ",null,{"$f":"VLOOKUP(ORGANIZADORES!$B$13,ORGANIZADORES!$A$3:$P$12,12,FALSE)","v":"rallyracc@racc.es"}]
[]
[null,null,"DADES DE LA PROVA"]
[null,null,null,null,"EMPLENAR AQUEST FORMULARI I REENVIARLO EN FORMAT EXCEL VIA MAIL"]
[null,null,null,"Nom:",null,null,null,null,null,null,null,null,null,null,null,"Data:",null,{"$f":"VLOOKUP(ORGANIZADORES!$B$13,ORGANIZADORES!A3:P11,3,FALSE)","v":"20/21 d'OCTUBRE 2023"}]
[null,null,null,null,null,null,"TRIAR LA PROVA",null,null,null,null,null,null,null,null,"Límit ins.:",null,{"$f":"VLOOKUP(ORGANIZADORES!$B$13,ORGANIZADORES!A3:P11,16,FALSE)","v":"2023-10-11"}]
[]
[null,null,"DADES EQUIP"]
[]
[null,null,"CONCURSANT",null,null,"INDIVIDUAL"]
[null,null,null,null,null,"1r Cognom",null,null,null,null,"2n Cognom",null,null,null,null,"Nom:"]
[]
[null,null,null,null,null,"COL·LECTIU"]
[null,null,null,null,null,"Denominació:",null,null,null,null,null,null,null,null,"Nom Representant:"]
[]
[null,null,null,null,null,"Direcció:",null,null,null,null,null,null,null,null,"C.P.:","Població:"]
[]
[null,null,null,null,null,"Província:",null,null,null,"País:",null,null,null,null,"NIF / CIF:",null,"Llicència:",null,"Copia:"]
[null,null,null,null,null,null,null,null,null,null,null,null,null,null,null,null,"          "]
[null,null,null,null,null,"Telèfon MÓBIL:",null,null,"Telèfon FIX:",null,null,"FAX:",null,null,null,"e-mail:"]
[]
[]
[null,null,"PILOT",null,null,"1r Cognom",null,null,null,null,"2n Cognom",null,null,null,null,"Nom:"]
[]
[null,null,null,null,null,"Direcció:",null,null,null,null,null,null,null,null,"C.P.:","Població:"]
[]
[null,null,null,null,null,"Província:",null,null,null,"País:",null,null,null,null,"NIF:",null,"Llicència:",null,"Junior:"]
[null,null,null,null,null,null,null,null,null,null,null,null,null,null,null,null," "]
[null,null,null,null,null,"Telèfon MÓBIL:",null,null,"Telèfon FIX:",null,null,"FAX:",null,null,null,"e-mail:"]
[]
[]
[null,null,"COPILOT",null,null,"1r Cognom",null,null,null,null,"2n Cognom",null,null,null,null,"Nom:"]
[]
[null,null,null,null,null,"Direcció:",null,null,null,null,null,null,null,null,"C.P.:","Població:"]
[]
[null,null,null,null,null,"Província:",null,null,null,"País:",null,null,null,null,"NIF:",null,"Llicència:"]
[null,null,null,null,null,null,null,null,null,null,null,null,null,null,null,null," "]
[null,null,null,null,null,"Telèfon MÓBIL:",null,null,"Telèfon FIX:",null,null,"FAX:",null,null,null,"e-mail:"]
[]
[]
[null,null,"DADES del VEHICLE"]
[]
[null,null,"Marca:",null,null,null,null,"Model:",null,null,null,"Matrícula:",null,null,null,"Cilindrada:",null,"Turbo:","Cilindrada Corr.:"]
[null,null,null,null,null,null,null,null,null,null,null,null,null,null,null,null,null,null,{"$f":"IF(AND(P57=0),\"\",IF(datos!H1=TRUE,P57*1.7,P57))","v":""}]
[null,null,"Fitxa Homologació:",null,null,null,null,"Grup i Classe:",null,null,null,"Puntuabilitat",null,null,null,null,null,"Copa Monomarca:"]
[]
[null,null,"Tracció:",null,null,null,null,{"$f":"datos!D12","v":"FALTA GRUP"}]
[null,null,null,"NO SERAN ACCEPTADES les inscripcions a les que els hi falti alguna de les dades resenyades anteriorment. "]
[]
[null,null,"Nom Pilot",null,null,null,null,null,null,null,null,null,"Nom Copilot"]
[null,null,{"$f":"IF(F37=0,\"\",CONCATENATE(P37,datos!P1,F37,datos!P1,K37))","v":""},null,null,null,null,null,null,null,null,null,{"$f":"IF(F46=0,\"\",(CONCATENATE(P46,datos!P1,F46,datos!P1,K46)))","v":""}]
[]
[null,null,"DRETS d'INSCRIPCIÓ"]
[]
[null,null,"DRETS d'INSCRIPCIÓ",null,null,null,null,null,null,null,null,null,"IMPORT de DRETS a PAGAR"]
[null,null,null,null,null,"Acceptant publicitat facultativa Campionat Catalunya",null,null,null,null,null,null,null,null,"Drets d'Inscripció",null,null,null,{"$f":"IF(OR(datos!G1=1),datos!E1,(IF(OR(datos!G1=2),datos!F1,(IF(OR(datos!G1=3),datos!F2,(IF(OR(datos!G1=4),datos!F3,\"\")))))))","v":425}]
[null,null,null,null,null,"Volant RACC",null,null,null,null,null,null,null,null,"     Rebutjo la publicitat facultativa"]
[null,null,null,null,null,"Acceptant publicitat facultativa Camp. Catalunya Promoció"]
[null,null,null,null,null,null,null,null,null,null,null,null,null,null,"TOTAL DRETS",null,null,null,{"$f":"IF(datos!H2=TRUE,((S69)+S69),'Hoja inscripción'!S69)+S71","v":425}]
[null,null,"Dades facturació Drets Inscripció:",null,null,null,null,null,null,null,null,null,"FORMA DE PAGAMENT"]
[null,null,null,"Nombre",null,null,null,null,null,null,null,null,null,null,"El pagament dels drets s'ha d'efectuar mitjançant transferència bancària"]
[null,null,null,"NIF / CIF:",null,null,null,null,null,null,null,null,null,null,"i enviar per correu electrònic el justificant de transferencia a:"]
[null,null,null,"Dirección:",null,null,null,null,null,null,null,null,null,null,"Beneficiari:",{"$f":"E10","v":"RACC"}]
[null,null,null,"Localidad:",null,null,null,null,null,null,null,null,null,null,"Entitat",{"$f":"VLOOKUP(ORGANIZADORES!$B$13,ORGANIZADORES!$A$3:$P$12,14,FALSE)","v":"Banc Sabadell"},"ESCUDERIA COSTA DAURADA","ESCUDERIA COSTA DAURADA","ESCUDERIA COSTA DAURADA","ESCUDERIA COSTA DAURADA"]
[null,null,null,"C.Postal",null,null,null,"Provincia:",null,null,null,null,null,null,"IBAN:",{"$f":"VLOOKUP(ORGANIZADORES!$B$13,ORGANIZADORES!$A$3:$P$12,15,FALSE)","v":"ES03 0081 0105 1200 0101 4203"},"ESCUDERIA COSTA DAURADA","ESCUDERIA COSTA DAURADA","ESCUDERIA COSTA DAURADA","ESCUDERIA COSTA DAURADA"]
[]
[]
{"$rows_left_out":43}
{"sheet":"export","index":1,"n_rows":7,"n_cols":62,"rows_kept":7,"cut":false,"hidden":true,"merged":[]}
["NumeroOrden","NombreCompetidor","PrimerApellidoCompetidor","SegundoApellidoCompetidor","NomApeCompetidor","NacionalidadCompetidor","LicenciaConmpetidor","DniCifCompetidor","DireccionCompetidor","CodigoPostalCompetidor","PoblacionCompetidor","ProvinciaCompetidor","Telefono1Competidor","Telefono2Competidor","FaxCompetidor","EMailCompetidor","NombrePiloto","PrimerApellidoPiloto","SegundoApellidoPiloto","NomApePiloto","NacionalidadPiloto","LicenciaPiloto","DniCifPiloto","DireccionPiloto","CodigoPostalPiloto","PoblacionPiloto","ProvinciaPiloto","Telefono1Piloto","Telefono2Piloto","FaxPiloto","EMailPiloto","NombreCopiloto","PrimerApellidoCopiloto","SegundoApellidoCopiloto","NomApeCopiloto","NacionalidadCopiloto","LicenciaCopiloto","DniCifCopiloto","DireccionCopiloto","CodigoPostalCopiloto","PoblacionCopiloto","ProvinciaCopiloto","Telefono1Copiloto","Telefono2Copiloto","FaxCopiloto","EMailCopiloto","Marca","Modelo","Matricula","Cilindrada","FichaHomologacion","Grupo","Tracción","Clase","challenge/copa","Fecha","Hora","PUNTUABILIDAD","Trofeo Junior Piloto","Trofeo Junior Copiloto","Bastidor","Num. Pasaporte RFEDA"]
[{"$f":"'Hoja inscripción'!S11","v":0},{"$f":"IF('Hoja inscripción'!F28=\"\",IF('Hoja inscripción'!P25=\"\",\"\",IF(LEN('Hoja inscripción'!P25)>50,PROPER(LEFT('Hoja inscripción'!P25,50)),PROPER('Hoja inscripción'!P25))),IF(LEN('Hoja inscripción'!F28)>50,UPPER(LEFT('Hoja inscripción'!F28,50)),UPPER('Hoja inscripción'!F28)))","v":""},{"$f":"IF('Hoja inscripción'!F25=\"\",\"\",IF(LEN('Hoja inscripción'!F25)>25,UPPER(LEFT('Hoja inscripción'!F25,25)),UPPER('Hoja inscripción'!F25)))","v":""},{"$f":"IF('Hoja inscripción'!K25=\"\",\"\",IF(LEN('Hoja inscripción'!K25)>25,UPPER(LEFT('Hoja inscripción'!K25,25)),UPPER('Hoja inscripción'!K25)))","v":""},{"$f":"B2&\" \"&C2&\" \"&D2","v":"  "},{"$f":"IF('Hoja inscripción'!J32=\"\",\"\",UPPER(LEFT('Hoja inscripción'!J32,3)))","v":""},{"$f":"IF('Hoja inscripción'!Q32=\"\",\"\",IF(LEN('Hoja inscripción'!Q32)>20,UPPER(LEFT('Hoja inscripción'!Q32,20)),UPPER('Hoja inscripción'!Q32)))","v":"          "},{"$f":"IF('Hoja inscripción'!O32=\"\",\"\",IF(LEN('Hoja inscripción'!O32)>20,UPPER(LEFT('Hoja inscripción'!O32,20)),UPPER('Hoja inscripción'!O32)))","v":""},{"$f":"IF('Hoja inscripción'!F30=\"\",\"\",IF(LEN('Hoja inscripción'!F30)>40,PROPER(LEFT('Hoja inscripción'!F30,40)),PROPER('Hoja inscripción'!F30)))","v":""},{"$f":"IF('Hoja inscripción'!O30=\"\",\"\",IF(LEN('Hoja inscripción'!O30)>10,LEFT('Hoja inscripción'!O30,10),'Hoja inscripción'!O30))","v":""},{"$f":"IF('Hoja inscripción'!P30=\"\",\"\",IF(LEN('Hoja inscripción'!P30)>25,PROPER(LEFT('Hoja inscripción'!P30,25)),PROPER('Hoja inscripción'!P30)))","v":""},{"$f":"IF('Hoja inscripción'!F32=\"\",\"\",IF(LEN('Hoja inscripción'!F32)>25,UPPER(LEFT('Hoja inscripción'!F32,25)),UPPER('Hoja inscripción'!F32)))","v":""},{"$f":"IF('Hoja inscripción'!F34=\"\",\"\",IF(LEN('Hoja inscripción'!F34)>15,LEFT('Hoja inscripción'!F34,15),'Hoja inscripción'!F34))","v":""},{"$f":"IF('Hoja inscripción'!I34=\"\",\"\",IF(LEN('Hoja inscripción'!I34)>15,LEFT('Hoja inscripción'!I34,15),'Hoja inscripción'!I34))","v":""},{"$f":"IF('Hoja inscripción'!L34=\"\",\"\",IF(LEN('Hoja inscripción'!L34)>15,LEFT('Hoja inscripción'!L34,15),'Hoja inscripción'!L34))","v":""},{"$f":"IF('Hoja inscripción'!P34=\"\",\"\",IF(LEN('Hoja inscripción'!P34)>30,LEFT('Hoja inscripción'!P34,30),'Hoja inscripción'!P34))","v":""},{"$f":"IF('Hoja inscripción'!P37=\"\",\"\",IF(LEN('Hoja inscripción'!P37)>25,PROPER(LEFT('Hoja inscripción'!P37,25)),PROPER('Hoja inscripción'!P37)))","v":""},{"$f":"IF('Hoja inscripción'!F37=\"\",\"\",IF(LEN('Hoja inscripción'!F37)>25,UPPER(LEFT('Hoja inscripción'!F37,25)),UPPER('Hoja inscripción'!F37)))","v":""},{"$f":"IF('Hoja inscripción'!K37=\"\",\"\",IF(LEN('Hoja inscripción'!K37)>25,UPPER(LEFT('Hoja inscripción'!K37,25)),UPPER('Hoja inscripción'!K37)))","v":""},{"$f":"Q2&\" \"&R2&\" \"&S2","v":"  "},{"$f":"IF('Hoja inscripción'!J41=\"\",\"\",UPPER(LEFT('Hoja inscripción'!J41,3)))","v":""},{"$f":"IF('Hoja inscripción'!Q41=\"\",\"\",IF(LEN('Hoja inscripción'!Q41)>20,UPPER(LEFT('Hoja inscripción'!Q41,20)),UPPER('Hoja inscripción'!Q41)))","v":" "},{"$f":"IF('Hoja inscripción'!O41=\"\",\"\",IF(LEN('Hoja inscripción'!O41)>20,UPPER(LEFT('Hoja inscripción'!O41,20)),UPPER('Hoja inscripción'!O41)))","v":""},{"$f":"IF('Hoja inscripción'!F39=\"\",\"\",IF(LEN('Hoja inscripción'!F39)>40,PROPER(LEFT('Hoja inscripción'!F39,40)),PROPER('Hoja inscripción'!F39)))","v":""},{"$f":"IF('Hoja inscripción'!O39=\"\",\"\",IF(LEN('Hoja inscripción'!O39)>10,LEFT('Hoja inscripción'!O39,10),'Hoja inscripción'!O39))","v":""},{"$f":"IF('Hoja inscripción'!P39=\"\",\"\",IF(LEN('Hoja inscripción'!P39)>25,PROPER(LEFT('Hoja inscripción'!P39,25)),PROPER('Hoja inscripción'!P39)))","v":""},{"$f":"IF('Hoja inscripción'!F41=\"\",\"\",IF(LEN('Hoja inscripción'!F41)>25,UPPER(LEFT('Hoja inscripción'!F41,25)),UPPER('Hoja inscripción'!F41)))","v":""},{"$f":"IF('Hoja inscripción'!F43=\"\",\"\",IF(LEN('Hoja inscripción'!F43)>15,LEFT('Hoja inscripción'!F43,15),'Hoja inscripción'!F43))","v":""},{"$f":"IF('Hoja inscripción'!I43=\"\",\"\",IF(LEN('Hoja inscripción'!I43)>15,LEFT('Hoja inscripción'!I43,15),'Hoja inscripción'!I43))","v":""},{"$f":"IF('Hoja inscripción'!L43=\"\",\"\",IF(LEN('Hoja inscripción'!L43)>15,LEFT('Hoja inscripción'!L43,15),'Hoja inscripción'!L43))","v":""},{"$f":"IF('Hoja inscripción'!P43=\"\",\"\",IF(LEN('Hoja inscripción'!P43)>30,LEFT('Hoja inscripción'!P43,30),'Hoja inscripción'!P43))","v":""},{"$f":"IF('Hoja inscripción'!P46=\"\",\"\",IF(LEN('Hoja inscripción'!P46)>25,PROPER(LEFT('Hoja inscripción'!P46,25)),PROPER('Hoja inscripción'!P46)))","v":""},{"$f":"IF('Hoja inscripción'!F46=\"\",\"\",IF(LEN('Hoja inscripción'!F46)>25,UPPER(LEFT('Hoja inscripción'!F46,25)),UPPER('Hoja inscripción'!F46)))","v":""},{"$f":"IF('Hoja inscripción'!K46=\"\",\"\",IF(LEN('Hoja inscripción'!K46)>25,UPPER(LEFT('Hoja inscripción'!K46,25)),UPPER('Hoja inscripción'!K46)))","v":""},{"$f":"AF2&\" \"&AG2&\" \"&AH2","v":"  "},{"$f":"IF('Hoja inscripción'!J50=\"\",\"\",UPPER(LEFT('Hoja inscripción'!J50,3)))","v":""},{"$f":"IF('Hoja inscripción'!Q50=\"\",\"\",IF(LEN('Hoja inscripción'!Q50)>20,UPPER(LEFT('Hoja inscripción'!Q50,20)),UPPER('Hoja inscripción'!Q50)))","v":" "},{"$f":"IF('Hoja inscripción'!O50=\"\",\"\",IF(LEN('Hoja inscripción'!O50)>20,UPPER(LEFT('Hoja inscripción'!O50,20)),UPPER('Hoja inscripción'!O50)))","v":""},{"$f":"IF('Hoja inscripción'!F48=\"\",\"\",IF(LEN('Hoja inscripción'!F48)>40,PROPER(LEFT('Hoja inscripción'!F48,40)),PROPER('Hoja inscripción'!F48)))","v":""},{"$f":"IF('Hoja inscripción'!O48=\"\",\"\",IF(LEN('Hoja inscripción'!O48)>10,LEFT('Hoja inscripción'!O48,10),'Hoja inscripción'!O48))","v":""},{"$f":"IF('Hoja inscripción'!P48=\"\",\"\",IF(LEN('Hoja inscripción'!P48)>25,PROPER(LEFT('Hoja inscripción'!P48,25)),PROPER('Hoja inscripción'!P48)))","v":""},{"$f":"IF('Hoja inscripción'!F50=\"\",\"\",IF(LEN('Hoja inscripción'!F50)>25,UPPER(LEFT('Hoja inscripción'!F50,25)),UPPER('Hoja inscripción'!F50)))","v":""},{"$f":"IF('Hoja inscripción'!F52=\"\",\"\",IF(LEN('Hoja inscripción'!F52)>15,LEFT('Hoja inscripción'!F52,15),'Hoja inscripción'!F52))","v":""},{"$f":"IF('Hoja inscripción'!I52=\"\",\"\",IF(LEN('Hoja inscripción'!I52)>15,LEFT('Hoja inscripción'!I52,15),'Hoja inscripción'!I52))","v":""},{"$f":"IF('Hoja inscripción'!L52=\"\",\"\",IF(LEN('Hoja inscripción'!L52)>15,LEFT('Hoja inscripción'!L52,15),'Hoja inscripción'!L52))","v":""},{"$f":"IF('Hoja inscripción'!P52=\"\",\"\",IF(LEN('Hoja inscripción'!P52)>30,LEFT('Hoja inscripción'!P52,30),'Hoja inscripción'!P52))","v":""},{"$f":"IF('Hoja inscripción'!C57=\"\",\"\",IF(LEN('Hoja inscripción'!C57)>25,UPPER(LEFT('Hoja inscripción'!C57,25)),UPPER('Hoja inscripción'!C57)))","v":""},{"$f":"IF('Hoja inscripción'!H57=\"\",\"\",IF(LEN('Hoja inscripción'!H57)>25,UPPER(LEFT('Hoja inscripción'!H57,25)),UPPER('Hoja inscripción'!H57)))","v":""},{"$f":"IF('Hoja inscripción'!L57=\"\",\"\",IF(LEN('Hoja inscripción'!L57)>25,UPPER(LEFT('Hoja inscripción'!L57,25)),UPPER('Hoja inscripción'!L57)))","v":""},{"$f":"IF('Hoja inscripción'!S57=\"\",\"\",IF(LEN('Hoja inscripción'!S57)>25,UPPER(LEFT('Hoja inscripción'!S57,25)),UPPER('Hoja inscripción'!S57)))","v":""},{"$f":"IF('Hoja inscripción'!C59=\"\",\"\",IF(LEN('Hoja inscripción'!C59)>25,UPPER(LEFT('Hoja inscripción'!C59,25)),UPPER('Hoja inscripción'!C59)))","v":""},{"$f":"IF(datos!D9=\"\",\"\",IF(LEN(datos!D9)>6,UPPER(LEFT(datos!D9,5)),UPPER(datos!D9)))","v":{"$error":"#N/A"}},{"$f":"IF(datos!D12=\"\",\"\",IF(LEN(datos!D12)>15,LEFT(datos!D12,15),datos!D12))","v":"FALTA GRUP"},{"$f":"IF(datos!D9=\"\",\"\",IF(LEN(datos!D9)>6,UPPER(LEFT(datos!D9,4)),UPPER(datos!D9)))","v":{"$error":"#N/A"}},{"$f":"IF(datos!D11=\"\",\"\",IF(LEN(datos!D11)>25,LEFT(datos!D11,25),datos!D11))","v":"Seleccionar"},null,null,{"$f":"IF(datos!D10=\"\",\"\",IF(LEN(datos!D10)>25,LEFT(datos!D10,25),datos!D10))","v":"Seleccionar"},{"$f":"IF(datos!M1=\"\",\"\",IF(LEN(datos!M1)>2,UPPER(LEFT(datos!M1,2)),UPPER(datos!M1)))","v":"0"},{"$f":"IF(datos!P12=\"\",\"\",IF(LEN(datos!P12)>5,LEFT(datos!P12,5),datos!P12))","v":""},{"$f":"IF('Hoja inscripción'!H61=\"\",\"\",IF(LEN('Hoja inscripción'!H61)>25,UPPER(LEFT('Hoja inscripción'!H61,25)),UPPER('Hoja inscripción'!H61)))","v":""},{"$f":"IF('Hoja inscripción'!C61=\"\",\"\",IF(LEN('Hoja inscripción'!C61)>25,UPPER(LEFT('Hoja inscripción'!C61,25)),UPPER('Hoja inscripción'!C61)))","v":""}]
["ORDEN","NUMERO","COMPETIDOR","NAC","LICENCIA\nCompetidor","NIF \nCompetidor","Dirección Competidor","Representante","mobil competidor","email\ncompetidor","PILOTO","NAC/CCAA\nPILOTO","LICENCIA\nPILOTO","NIF\npiloto","JUNIOR PILOTO","Télefono\n Piloto","email\nPiloto","direccion piloto","COPILOTO","NAC/CCAA\nCOPILOTO","LICENCIA \nCOPILOTO","NIF\n Copiloto","JUNIOR COPILOTO","Télefono Copiloto","email\ncopiloto","direccion copiloto","MARCA              VEHÍCULO","GRUPO","CLASSE","TRACCIÓN","PUNTUABILIDAD","Challenge","BASTIDOR","MATRICULA","FICHA HOM FIA","PASAPORTE FCA","CILINDRADA"]
[{"$f":"A2","v":0},null,{"$f":"E2","v":"  "},{"$f":"F2","v":""},{"$f":"G2","v":"          "},{"$f":"H2","v":""},{"$f":"I2&\" \"&J2&\" \"&K2&\" \"&L2","v":"   "},null,{"$f":"M2","v":""},{"$f":"P2","v":""},{"$f":"T2","v":"  "},{"$f":"U2","v":""},{"$f":"V2","v":" "},{"$f":"W2","v":""},{"$f":"BG2","v":"0"},{"$f":"AB2","v":""},{"$f":"AE2","v":""},{"$f":"X2&\" \"&Y2&\" \"&Z2&\" \"&AA2","v":"   "},{"$f":"AI2","v":"  "},{"$f":"AJ2","v":""},{"$f":"AK2","v":" "},{"$f":"AL2","v":""},{"$f":"BH2","v":""},{"$f":"AQ2","v":""},{"$f":"AT2","v":""},{"$f":"AM2&\" \"&AN2&\" \"&AO2&\" \"&AP2","v":"   "},{"$f":"AU2&\" \"&AV2","v":" "},{"$f":"AZ2","v":{"$error":"#N/A"}},{"$f":"MID(BB2,4,1)","v":{"$error":"#N/A"}},{"$f":"BA2","v":"FALTA GRUP"},{"$f":"BF2","v":"Seleccionar"},{"$f":"BC2","v":"Seleccionar"},{"$f":"BI2","v":""},{"$f":"AW2","v":""},{"$f":"AY2","v":""},{"$f":"BJ2","v":""},{"$f":"AX2","v":""}]
[]
[]
["COPIAR LA LINEA 4 I ENGANXAR VALORS EN LA FULLA DATOS DEL ARXIU LLISTA D'ISNCRITS."]

{"sheet":"datos","index":2,"n_rows":36,"n_cols":16,"rows_kept":36,"cut":false,"hidden":true,"merged":[]}
["Seleccionar de la lista",1,"Seleccionar",1,425,350,1,false,null,1,null,null,{"$f":"'Hoja inscripción'!$S$41","v":0},null,null," "]
["N2/1 (Grup N 2RM fins 1600)",2,"Campionat Catalunya",1,null,380,1,false]
["N2/2 (Grup N 2RM més 1600)",3,"C.C. Promo.",null,null,null,null,false]
["N4/3 (Grup N 4RM totes cilindrades)",4,"Copa SBS"]
["A2/4 (Grup A 2RM fins 1600)",5,"Open SBS"]
["A2/5 (Grup A 2RM mésç 1600)",6]
["A4/6 (Grup A 4RM totes cilindrades) ",7]
["P2/7 (Grup Proto 2RM totes cilindrades)",8,"Seleccionar"]
["P4/8 (Grup Proto 4RM totes cilindrades)",9,"Volant RACC",{"$f":"VLOOKUP(D1,F9:G31,2,FALSE)","v":{"$error":"#N/A"}},null,2,"N2/1 (Grup N 2RM fins 1600)"]
["TT",10,null,{"$f":"VLOOKUP(D2,B1:C6,2,TRUE)","v":"Seleccionar"},null,3,"N2/2 (Grup N 2RM més 1600)"]
["SBS-UTV",11,null,{"$f":"VLOOKUP(J1,F33:G36,2,TRUE)","v":"Seleccionar"},null,4,"N4/3 (Grup N 4RM totes cilindrades)"]
["SBS-2",12,null,{"$f":"IF(datos!D1=1,\"FALTA GRUP\",IF(datos!D1=2,\"2RM\",IF(datos!D1=3,\"2RM\",IF(datos!D1=5,\"2RM\",IF(datos!D1=6,\"2RM\",IF(datos!D1=8,\"2RM\",IF(datos!D1=10,\"---\",IF(datos!D1>=11,\"---\",\"4RM\"))))))))","v":"FALTA GRUP"},null,5,"A2/4 (Grup A 2RM fins 1600)"]
[null,13,null,null,null,6,"A2/5 (Grup A 2RM mésç 1600)"]
[null,14,null,null,null,7,"A4/6 (Grup A 4RM totes cilindrades) "]
[null,15,null,null,null,8,"P2/7 (Grup Proto 2RM totes cilindrades)"]
[null,16,null,null,null,9,"P4/8 (Grup Proto 4RM totes cilindrades)"]
[null,17,null,null,null,10,"TT"]
[null,18,null,null,null,11,"SBS-UTV"]
[null,19,null,null,null,12,"SBS-2"]
[null,20,null,null,null,13]
[null,21,null,null,null,14]
[null,22,null,null,null,15]
[null,23,null,null,null,16]
[null,24,null,null,null,17]
[null,25,null,null,null,18]
[null,null,null,null,null,19]
[null,null,null,null,null,20]
[null,null,null,null,null,21]
[null,null,null,null,null,22]
[null,null,null,null,null,23]
[null,null,null,null,null,24]
[null,null,null,null,null,25]
[null,null,null,null,null,1,"Seleccionar"]
[{"$f":"IF(AND(datos!D1=9,'Hoja inscripción'!S57=\"\"),\"FALTA CILINDRADA\",IF(AND(datos!D1=9,'Hoja inscripción'!S57>1600),\"Categoria 1\",IF(AND(datos!D1=9,'Hoja inscripción'!S57<=1600),\"Categoria 2\",IF(AND(datos!D1=10,datos!D2=1),\"FALTA MOTRICIDAD\",IF(AND(datos!D1=10,datos!D2=2),\"Categoria 2\",IF(AND(datos!D1=10,datos!D2=3),\"Categoria 1\",B34))))))","v":0},null,null,null,null,2,"Volant RACC"]
[null,null,null,null,null,3,"Challenge Saxo 8v"]
[null,null,null,null,null,4]

{"sheet":"ORGANIZADORES","index":3,"n_rows":13,"n_cols":16,"rows_kept":13,"cut":false,"hidden":true,"merged":[]}
[null,null,null,null,null,null,null,null," "]
["Nº","Nombre de la Prueba",null,"Club Organizador","Dirección","C.P.","Localidad","Provincia",null,"Teléfono","Fax","E_Mail","web","banco","cta","tancament"]
[1,"1r Ral·li La Conca de Barberà","3 de JUNY 2023","ESC. T.R.A.Msport",null,null,null,null,{"$f":"CONCATENATE(F3,$I$1,G3,$I$1,H3)","v":"  "},"666 82 26 78",null,"escuderiatramsport@gmail.com","www.escuderiatram.com","CAIXAGUISSONA","ES08 3140 0001 9900 1347 0700","30/05/2023"]
[2,"4rt Memorial Abel Puig","2 de SETEMBRE 2023","WRC MANAGEMENT","C/ Nord, 49","25300","TARREGA","(LLEIDA)",{"$f":"CONCATENATE(F4,$I$1,G4,$I$1,H4)","v":"25300 TARREGA (LLEIDA)"},"627 47 79 63",null,"info@wrcmanagement.es","www.wrcmanagement.es","BBVA","ES74.0182.0846.4002.0167.9962","2023-08-29"]
[3,"14è Ral·li Vidreres","30 de SETEMBRE 2023","PEUABAIX MOTORSPORT","C/ Cor de Maria 2, 3","17002","GIRONA","(GIRONA)",{"$f":"CONCATENATE(F5,$I$1,G5,$I$1,H5)","v":"17002 GIRONA (GIRONA)"},"630 983 780",null,"peuabaix@peuabaix.com","www.peuabaix.com","B.B.V.A","ES95.0182.2383.5002.0173.6395","2023-09-26"]
[4,"RallyRACC Catalunya - Costa Daurada","20/21 d'OCTUBRE 2023","RACC","Avda. Diagonal, 687","08028","BARCELONA","(BCN)",{"$f":"CONCATENATE(F6,$I$1,G6,$I$1,H6)","v":"08028 BARCELONA (BCN)"},"93 495 50 34",null,"rallyracc@racc.es","www.rallyracc.com","Banc Sabadell","ES03 0081 0105 1200 0101 4203","2023-10-11"]
[5,"29è Ral·li Ciutat de Tàrrega","11/12 de NOVEMBRE 2023","ESCUDERIA TÀRREGA","C/ Sant Pere Claver, 18 BAIXOS","25300","TÀRREGA","(LLEIDA)",{"$f":"CONCATENATE(F7,$I$1,G7,$I$1,H7)","v":"25300 TÀRREGA (LLEIDA)"},"670 919 181",null,"inscripcions@escuderiatarrega.com","www.escuderiatarrega.com","CAIXA GUISSONA","ES61.3140.0001.9700.1314.4700","2023-11-07"]
[6]
[]
[]
[]
[]
[null,4]